BDBM50008850 2-(3,4-Dichloro-phenyl)-N-methyl-N-(2-pyrrolidin-1-yl-ethyl)-acetamide::CHEMBL56744
SMILES CN(CCN1CCCC1)C(=O)Cc1ccc(Cl)c(Cl)c1
InChI Key InChIKey=GVNXYKYZZJNHNQ-UHFFFAOYSA-N
Data  1 IC50
  Tab Delimited (TSV)   2D SDfile   Computed 3D by Vconf -m prep SDfile
Find this compound or compounds like it in BindingDB:
Activity Spreadsheet -- Enzyme Inhibition Constant Data from BindingDB
Found 1 hit for monomerid = 50008850
TargetKappa-type opioid receptor(Cavia porcellus (domestic guinea pig))
Ici Pharmaceuticals Group
Curated by ChEMBL
LigandPNGBDBM50008850(2-(3,4-Dichloro-phenyl)-N-methyl-N-(2-pyrrolidin-1...)
Affinity DataIC50:  6.12E+3nM. Assay description: Compound was evaluated for the opioid receptor kappa affinity using guinea pig brain membranes.
In DepthDetails ArticlePubMed