BDBM50008852 2-Methyl-acenaphthene-1-carboxylic acid (7-imidazolidin-1-yl-1-oxa-spiro[4.5]dec-8-yl)-methyl-amide; hydrochloride::CHEMBL543809
SMILES CC1C(C(=O)N(C)[C@H]2CCC3(CCCO3)C[C@@H]2N2CCNC2)c2cccc3cccc1c23
InChI Key InChIKey=FGPRCEIOCKKCMF-XCIMKVISSA-N
Data  2 KI
  Tab Delimited (TSV)   2D SDfile   Computed 3D by Vconf -m prep SDfile
Find this compound or compounds like it in BindingDB:
Activity Spreadsheet -- Enzyme Inhibition Constant Data from BindingDB
Found 2 hits for monomerid = 50008852
TargetKappa-type opioid receptor(Cavia porcellus (domestic guinea pig))
Parke-Davis Research Unit
Curated by ChEMBL
LigandPNGBDBM50008852(2-Methyl-acenaphthene-1-carboxylic acid (7-imidazo...)
Affinity DataKi:  1.20nM. Assay description: Opioid receptor kappa affinity, determined with [3H]etorphine in the presence of excess unlabeled [D-Ala2-MePhe4-Glyol5]-enkephalin
In DepthDetails ArticlePubMed
TargetMu-type opioid receptor(GUINEA PIG)
Parke-Davis Research Unit
Curated by ChEMBL
LigandPNGBDBM50008852(2-Methyl-acenaphthene-1-carboxylic acid (7-imidazo...)
Affinity DataKi:  273nM. Assay description: Compound was evaluated for the opioid receptor mu affinity determined with [3H][D-Ala2-MePhe4-Gly-ol5]-enkephalin (DAGOL) in the presence of excess u...
In DepthDetails ArticlePubMed