BDBM50008945 2,6-Dimethyl-4-[2-(5-methyl-1H-pyrazol-3-yl)-vinyl]-phenol::CHEMBL146701
SMILES Cc1cc(C=Cc2cc(C)c(O)c(C)c2)[nH]n1
InChI Key InChIKey=CJYWMUBMXOPPSA-UHFFFAOYSA-N
Data  2 IC50
  Tab Delimited (TSV)   2D SDfile   Computed 3D by Vconf -m prep SDfile
Find this compound or compounds like it in BindingDB:
Activity Spreadsheet -- Enzyme Inhibition Constant Data from BindingDB
Found 2 hits for monomerid = 50008945
TargetProstaglandin G/H synthase 1/2(RAT)
Warner-Lambert
Curated by ChEMBL
LigandPNGBDBM50008945(2,6-Dimethyl-4-[2-(5-methyl-1H-pyrazol-3-yl)-vinyl...)
Affinity DataIC50:  4.60E+3nM. Assay description: Inhibitory activity against cyclooxygenase in rat basophilic leukemia cells using prostaglandin G/H synthase assay
In DepthDetails ArticlePubMed
TargetPolyunsaturated fatty acid 5-lipoxygenase(Rattus norvegicus)
Warner-Lambert
Curated by ChEMBL
LigandPNGBDBM50008945(2,6-Dimethyl-4-[2-(5-methyl-1H-pyrazol-3-yl)-vinyl...)
Affinity DataIC50:  800nM. Assay description: Inhibitory activity against 5-lipoxygenase in rat basophilic leukemia cells
In DepthDetails ArticlePubMed