BDBM50009019 2-(6-Methyl-pyridin-3-ylmethyl)-1,2-dihydro-indazol-3-one::CHEMBL3144573
SMILES Cc1ccc(Cn2[nH]c3ccccc3c2=O)cn1
InChI Key InChIKey=SFPXGACHZBKLPH-UHFFFAOYSA-N
Data  2 IC50  1 EC50
  Tab Delimited (TSV)   2D SDfile   Computed 3D by Vconf -m prep SDfile
Find this compound or compounds like it in BindingDB:
Activity Spreadsheet -- Enzyme Inhibition Constant Data from BindingDB
Found 3 hits for monomerid = 50009019
TargetPolyunsaturated fatty acid 5-lipoxygenase(Rattus norvegicus)
Ici Pharmaceuticals Group
Curated by ChEMBL
LigandPNGBDBM50009019(2-(6-Methyl-pyridin-3-ylmethyl)-1,2-dihydro-indazo...)
Affinity DataIC50:  2.50E+3nM. Assay description: In vitro inhibition of LTB4 production was measured in rat blood
In DepthDetails ArticlePubMed
TargetPolyunsaturated fatty acid 5-lipoxygenase(Homo sapiens (Human))
Ici Pharmaceuticals Group
Curated by ChEMBL
LigandPNGBDBM50009019(2-(6-Methyl-pyridin-3-ylmethyl)-1,2-dihydro-indazo...)
Affinity DataEC50:  4.17E+4nM. Assay description: Ex vivo inhibition of LTB4 production was measured in dog blood
In DepthDetails ArticlePubMed
TargetProstaglandin G/H synthase 1/2(RAT)
Ici Pharmaceuticals Group
Curated by ChEMBL
LigandPNGBDBM50009019(2-(6-Methyl-pyridin-3-ylmethyl)-1,2-dihydro-indazo...)
Affinity DataIC50:  2.10E+4nM. Assay description: In vitro inhibition of PGE-2 production was measured in rat blood
In DepthDetails ArticlePubMed