BDBM50009028 Acetic acid 2-(4-methoxy-3,5-dimethyl-pyridin-2-ylmethanesulfinyl)-benzoimidazol-1-ylmethyl ester::CHEMBL10209
SMILES COc1c(C)cnc(CS(=O)c2nc3ccccc3n2COC(C)=O)c1C
InChI Key InChIKey=SKKQQEZFYKPUOQ-UHFFFAOYSA-N
Data  1 IC50
  Tab Delimited (TSV)   2D SDfile   Computed 3D by Vconf -m prep SDfile
Find this compound or compounds like it in BindingDB:
Activity Spreadsheet -- Enzyme Inhibition Constant Data from BindingDB
Found 1 hit for monomerid = 50009028
LigandPNGBDBM50009028(Acetic acid 2-(4-methoxy-3,5-dimethyl-pyridin-2-yl...)
Affinity DataIC50:  5.00E+5nM. Assay description: Activity was evaluated by measuring the inhibition of isolated hog H+/K+ ATPase
In DepthDetails ArticlePubMed