BDBM50009223 2-[3-(1-Dimethylcarbamoylmethyl-3,3-dimethyl-1,3-dihydro-indol-2-ylidene)-propenyl]-1,3-diethyl-3H-imidazo[4,5-b]quinoxalin-1-ium; chloride::CHEMBL52448
SMILES CCn1c(\C=C\C=C2\N(CC(=O)N(C)C)c3ccccc3C2(C)C)[n+](CC)c2nc3ccccc3nc12
InChI Key InChIKey=GHOIHRCSBDTFBQ-UHFFFAOYSA-N
Data  1 IC50
  Tab Delimited (TSV)   2D SDfile   Computed 3D by Vconf -m prep SDfile
Find this compound or compounds like it in BindingDB:
Activity Spreadsheet -- Enzyme Inhibition Constant Data from BindingDB
Found 1 hit for monomerid = 50009223
TargetSubstance-P receptor(Rattus norvegicus (rat))
Rochester
Curated by ChEMBL
LigandPNGBDBM50009223(2-[3-(1-Dimethylcarbamoylmethyl-3,3-dimethyl-1,3-d...)
Affinity DataIC50:  2.60E+3nM. Assay description: Binding affinity for tachykinin receptor 1 from rat forebrain tissue, [125I]-BH-SP as radioligand
In DepthDetails ArticlePubMed