BDBM50009254 CHEMBL3233192
SMILES Cc1cc(O)cc(C)c1C[C@H](N)C(=O)N1CCC[C@H]1C(=O)N[C@@H](Cc1ccccc1)C(=O)N[C@@H](Cc1ccc2ccccc2c1)C(N)=O
InChI Key InChIKey=XQWLHPWPDQSALN-CUPIEXAXSA-N
Data  2 KI  2 IC50
  Tab Delimited (TSV)   2D SDfile   Computed 3D by Vconf -m prep SDfile
Find this compound or compounds like it in BindingDB:
Activity Spreadsheet -- Enzyme Inhibition Constant Data from BindingDB
Found 4 hits for monomerid = 50009254
TargetMu-type opioid receptor(Rattus norvegicus (rat))
Nanjing Medical University
Curated by ChEMBL
LigandPNGBDBM50009254(CHEMBL3233192)
Affinity DataKi:  0.810nM. Assay description: Displacement of [3H]DAMGO from mu opioid receptor in Sprague-Dawley rat brain P2 synaptosomal membranes
In DepthDetails ArticlePubMed
TargetDelta-type opioid receptor(Rattus norvegicus (rat))
Nanjing Medical University
Curated by ChEMBL
LigandPNGBDBM50009254(CHEMBL3233192)
Affinity DataKi:  23nM. Assay description: Displacement of [3H]deltorphin-2 from delta opioid receptor in Sprague-Dawley rat brain P2 synaptosomal membranes
In DepthDetails ArticlePubMed
TargetMu-type opioid receptor(GUINEA PIG)
Nanjing Medical University
Curated by ChEMBL
LigandPNGBDBM50009254(CHEMBL3233192)
Affinity DataIC50:  40nM. Assay description: Agonist activity at mu opioid receptor in guinea pig ileum assessed as inhibition of electrically-stimulated muscle contraction
In DepthDetails ArticlePubMed
TargetDelta-type opioid receptor(MOUSE)
Nanjing Medical University
Curated by ChEMBL
LigandPNGBDBM50009254(CHEMBL3233192)
Affinity DataIC50: >1.00E+4nM. Assay description: Agonist activity at delta opioid receptor in mouse vas deferens assessed as inhibition of electrically-stimulated muscle contraction
In DepthDetails ArticlePubMed