BDBM50009401 CHEMBL315931::Succinic acid 17-(2-chloro-acetyl)-9-fluoro-11-hydroxy-10,13,16-trimethyl-3-oxo-6,7,8,9,10,11,12,13,14,15,16,17-dodecahydro-3H-cyclopenta[a]phenanthren-17-yl ester methyl ester
SMILES COC(=O)CCC(=O)O[C@@]1([C@@H](C)CC2C3CCC4=CC(=O)C=CC4(C)[C@@]3(F)[C@@H](O)CC12C)C(=O)CCl
InChI Key InChIKey=OEZBWLHAAKESCK-QMTMZHOHSA-N
Data  1 IC50
  Tab Delimited (TSV)   2D SDfile   Computed 3D by Vconf -m prep SDfile
Find this compound or compounds like it in BindingDB:
Activity Spreadsheet -- Enzyme Inhibition Constant Data from BindingDB
Found 1 hit for monomerid = 50009401
TargetGlucocorticoid receptor(RAT)
Mitsubishi Kasei
Curated by ChEMBL
LigandPNGBDBM50009401(CHEMBL315931 | Succinic acid 17-(2-chloro-acetyl)-...)
Affinity DataIC50:  5.20nM. Assay description: Competitive displacement of [3H]dexamethasone from glucocorticoid receptor of rat liver cytosol
In DepthDetails ArticlePubMed