BDBM50009402 CHEMBL83845::Succinic acid tert-butyl ester 17-(2-chloro-acetyl)-9-fluoro-11-hydroxy-10,13,16-trimethyl-3-oxo-6,7,8,9,10,11,12,13,14,15,16,17-dodecahydro-3H-cyclopenta[a]phenanthren-17-yl ester
SMILES C[C@H]1CC2C3CCC4=CC(=O)C=CC4(C)[C@@]3(F)[C@@H](O)CC2(C)[C@@]1(OC(=O)CCC(=O)OC(C)(C)C)C(=O)CCl
InChI Key InChIKey=ATRIUXCDTABZSH-GJIXVOHXSA-N
Data  1 IC50
  Tab Delimited (TSV)   2D SDfile   Computed 3D by Vconf -m prep SDfile
Find this compound or compounds like it in BindingDB:
Activity Spreadsheet -- Enzyme Inhibition Constant Data from BindingDB
Found 1 hit for monomerid = 50009402
TargetGlucocorticoid receptor(RAT)
Mitsubishi Kasei
Curated by ChEMBL
LigandPNGBDBM50009402(CHEMBL83845 | Succinic acid tert-butyl ester 17-(2...)
Affinity DataIC50:  11nM. Assay description: Competitive displacement of [3H]dexamethasone from glucocorticoid receptor of rat liver cytosol
In DepthDetails ArticlePubMed