BDBM50009442 Acetic acid 10-acetoxymethyl-13-methyl-2,3,6,7,8,9,10,11,12,13,14,15,16,17-tetradecahydro-1H-cyclopenta[a]phenanthren-17-yl ester::CHEMBL311077
SMILES CC(=O)OCC12CCCC=C1CCC1C3CCC(OC(C)=O)C3(C)CCC21
InChI Key InChIKey=MEHJFIPYSWVCTE-UHFFFAOYSA-N
Data  1 IC50
  Tab Delimited (TSV)   2D SDfile   Computed 3D by Vconf -m prep SDfile
Find this compound or compounds like it in BindingDB:
Activity Spreadsheet -- Enzyme Inhibition Constant Data from BindingDB
Found 1 hit for monomerid = 50009442
TargetAromatase(Homo sapiens (Human))
Tohoku College Of Pharmacy
Curated by ChEMBL
LigandPNGBDBM50009442(Acetic acid 10-acetoxymethyl-13-methyl-2,3,6,7,8,9...)
Affinity DataIC50:  3.80E+4nM. Assay description: Inhibition of 1 uM [1-beta-3H]-androstenedione binding to human placental microsome Cytochrome P450 19A1
In DepthDetails ArticlePubMed