BDBM50009565 CHEMBL312992::Dimethyl-{4-[(Z)-2-(3,4,5-trimethoxy-phenyl)-vinyl]-phenyl}-amine::Dimethyl-{4-[2-(3,4,5-trimethoxy-phenyl)-vinyl]-phenyl}-amine
SMILES COc1cc(\C=C/c2ccc(cc2)N(C)C)cc(OC)c1OC
InChI Key InChIKey=PHDDAWSHQWUPPP-SREVYHEPSA-N
Data  2 IC50
  Tab Delimited (TSV)   2D SDfile   Computed 3D by Vconf -m prep SDfile
Find this compound or compounds like it in BindingDB:
Activity Spreadsheet -- Enzyme Inhibition Constant Data from BindingDB
Found 2 hits for monomerid = 50009565
TargetSimilar to alpha-tubulin isoform 1(Bos taurus)
Purdue University
Curated by ChEMBL
LigandPNGBDBM50009565(CHEMBL312992 | Dimethyl-{4-[(Z)-2-(3,4,5-trimethox...)
Affinity DataIC50:  3.40E+3nM. Assay description: Ability to inhibit Tubulin polymerization in Bovine brain
In DepthDetails ArticlePubMed
TargetTubulin alpha-1A chain(Sus scrofa (Pig))
Abbott Laboratories
Curated by ChEMBL
LigandPNGBDBM50009565(CHEMBL312992 | Dimethyl-{4-[(Z)-2-(3,4,5-trimethox...)
Affinity DataIC50:  1.70E+3nM. Assay description: Concentration required to inhibit polymerization of tubulin
In DepthDetails ArticlePubMed