BDBM50009613 7-Methoxy-2-pyridin-4-ylmethyl-3,4-dihydro-2H-naphthalen-1-one::CHEMBL93666
SMILES COc1ccc2CCC(Cc3ccncc3)C(=O)c2c1
InChI Key InChIKey=JXAWXANZSWKBCL-UHFFFAOYSA-N
Data  3 IC50
  Tab Delimited (TSV)   2D SDfile   Computed 3D by Vconf -m prep SDfile
Find this compound or compounds like it in BindingDB:
Activity Spreadsheet -- Enzyme Inhibition Constant Data from BindingDB
Found 3 hits for monomerid = 50009613
TargetAromatase(Homo sapiens (Human))
UniversitäT Des Saarlandes
Curated by ChEMBL
LigandPNGBDBM50009613(7-Methoxy-2-pyridin-4-ylmethyl-3,4-dihydro-2H-naph...)
Affinity DataIC50:  9.60E+3nM. Assay description: In vitro inhibitory concentration against Aromatase was determined using [1beta,2beta-3H]testosterone as radioligand
In DepthDetails ArticlePubMed
TargetAromatase(Homo sapiens (Human))
UniversitäT Des Saarlandes
Curated by ChEMBL
LigandPNGBDBM50009613(7-Methoxy-2-pyridin-4-ylmethyl-3,4-dihydro-2H-naph...)
Affinity DataIC50:  9.60E+3nM. Assay description: In vitro inhibitory concentration against Aromatase was determined using [1beta,2beta-3H]testosterone as radioligand
In DepthDetails ArticlePubMed
TargetAromatase(Homo sapiens (Human))
UniversitäT Des Saarlandes
Curated by ChEMBL
LigandPNGBDBM50009613(7-Methoxy-2-pyridin-4-ylmethyl-3,4-dihydro-2H-naph...)
Affinity DataIC50:  9.60E+3nM. Assay description: In vitro inhibitory concentration against Aromatase was determined using [1beta,2beta-3H]testosterone as radioligand
In DepthDetails ArticlePubMed