BDBM50009617 6-Hydroxy-2-pyridin-4-ylmethyl-3,4-dihydro-2H-naphthalen-1-one::CHEMBL91818
SMILES Oc1ccc2C(=O)C(Cc3ccncc3)CCc2c1
InChI Key InChIKey=LJEWMXPEINISGE-UHFFFAOYSA-N
Data  1 IC50
  Tab Delimited (TSV)   2D SDfile   Computed 3D by Vconf -m prep SDfile
Find this compound or compounds like it in BindingDB:
Activity Spreadsheet -- Enzyme Inhibition Constant Data from BindingDB
Found 1 hit for monomerid = 50009617
TargetAromatase(Homo sapiens (Human))
UniversitäT Des Saarlandes
Curated by ChEMBL
LigandPNGBDBM50009617(6-Hydroxy-2-pyridin-4-ylmethyl-3,4-dihydro-2H-naph...)
Affinity DataIC50:  6.20E+3nM. Assay description: In vitro inhibitory concentration against Aromatase was determined using [1beta,2beta-3H]testosterone as radioligand
In DepthDetails ArticlePubMed