BDBM50009623 CHEMBL330455::[1-(7-Cyclohexylmethyl-6-hydroxy-9,13-dioxo-1,4-dioxa-8,14-diaza-spiro[4.12]heptadec-10-ylcarbamoyl)-2-phenyl-ethyl]-carbamic acid tert-butyl ester
SMILES CC(C)(C)OC(=O)N[C@@H](Cc1ccccc1)C(=O)N[C@H]1CCC(=O)NCCCC2(OCCO2)[C@H](O)[C@H](CC2CCCCC2)NC1=O
InChI Key InChIKey=WZKOVMBSHSOODL-PFWSVGDOSA-N
Data  1 IC50
  Tab Delimited (TSV)   2D SDfile   Computed 3D by Vconf -m prep SDfile
Find this compound or compounds like it in BindingDB:
Activity Spreadsheet -- Enzyme Inhibition Constant Data from BindingDB
Found 1 hit for monomerid = 50009623
TargetRenin(Homo sapiens (Human))
Merck Sharp And Dohme Research Laboratories
Curated by ChEMBL
LigandPNGBDBM50009623(CHEMBL330455 | [1-(7-Cyclohexylmethyl-6-hydroxy-9,...)
Affinity DataIC50: >2.00E+4nMpH: 7.4Assay Description:The compound was evaluated in vitro for inhibition of human plasma renin at pH 7.4.
In DepthDetails ArticlePubMed