BDBM50009746 2-(10,10-Dioxo-10H-10lambda*6*-phenoxathiin-1-yl)-ethanol::CHEMBL66677
SMILES OCCc1cccc2Oc3ccccc3S(=O)(=O)c12
InChI Key InChIKey=WIDLMPSIFONHNH-UHFFFAOYSA-N
Data  2 IC50
  Tab Delimited (TSV)   2D SDfile   Computed 3D by Vconf -m prep SDfile
Find this compound or compounds like it in BindingDB:
Activity Spreadsheet -- Enzyme Inhibition Constant Data from BindingDB
Found 2 hits for monomerid = 50009746
TargetAmine oxidase [flavin-containing] A(Rattus norvegicus (rat))
The Wellcome Research Laboratories
Curated by ChEMBL
LigandPNGBDBM50009746(2-(10,10-Dioxo-10H-10lambda*6*-phenoxathiin-1-yl)-...)
Affinity DataIC50:  20nM. Assay description: Inhibitory concentration against monoamine oxidase A.
In DepthDetails ArticlePubMed
TargetAmine oxidase [flavin-containing] A(Rattus norvegicus (rat))
The Wellcome Research Laboratories
Curated by ChEMBL
LigandPNGBDBM50009746(2-(10,10-Dioxo-10H-10lambda*6*-phenoxathiin-1-yl)-...)
Affinity DataIC50:  20nM. Assay description: The compound was tested in vitro for inhibition of Monoamine Oxidase A from rat brain
In DepthDetails ArticlePubMed