BDBM50009769 (4-Oxo-3-thiazolo[5,4-b]pyridin-2-ylmethyl-3,4-dihydro-phthalazin-1-yl)-acetic acid::CHEMBL19289
SMILES OC(=O)Cc1nn(Cc2nc3cccnc3s2)c(=O)c2ccccc12
InChI Key InChIKey=ALGOKUNLOGYVHW-UHFFFAOYSA-N
Data  1 IC50
  Tab Delimited (TSV)   2D SDfile   Computed 3D by Vconf -m prep SDfile
Find this compound or compounds like it in BindingDB:
Activity Spreadsheet -- Enzyme Inhibition Constant Data from BindingDB
Found 1 hit for monomerid = 50009769
TargetAldo-keto reductase family 1 member B1(Homo sapiens (Human))
Pfizer
Curated by ChEMBL
LigandPNGBDBM50009769((4-Oxo-3-thiazolo[5,4-b]pyridin-2-ylmethyl-3,4-dih...)
Affinity DataIC50:  10nM. Assay description: Inhibition of aldose reductase (aldo-keto reductase, AKR1B1) isolated from human placenta.
In DepthDetails ArticlePubMed