BDBM50009778 CHEMBL414405::[3-(4-Benzothiazol-2-yl-benzyl)-4-oxo-3,4-dihydro-phthalazin-1-yl]-acetic acid
SMILES OC(=O)Cc1nn(Cc2ccc(cc2)-c2nc3ccccc3s2)c(=O)c2ccccc12
InChI Key InChIKey=PJXVPQIUWJKKNW-UHFFFAOYSA-N
Data  1 IC50
  Tab Delimited (TSV)   2D SDfile   Computed 3D by Vconf -m prep SDfile
Find this compound or compounds like it in BindingDB:
Activity Spreadsheet -- Enzyme Inhibition Constant Data from BindingDB
Found 1 hit for monomerid = 50009778
TargetAldo-keto reductase family 1 member B1(Homo sapiens (Human))
Pfizer
Curated by ChEMBL
LigandPNGBDBM50009778(CHEMBL414405 | [3-(4-Benzothiazol-2-yl-benzyl)-4-o...)
Affinity DataIC50: >1.00E+5nM. Assay description: Inhibition of aldose reductase (aldo-keto reductase, AKR1B1) isolated from human placenta.
In DepthDetails ArticlePubMed