BDBM50009796 (3-Benzothiazol-2-ylmethyl-6-chloro-4-oxo-3,4-dihydro-phthalazin-1-yl)-acetic acid::CHEMBL20796
SMILES OC(=O)Cc1nn(Cc2nc3ccccc3s2)c(=O)c2cc(Cl)ccc12
InChI Key InChIKey=DHIKLUATISJUTM-UHFFFAOYSA-N
Data  1 IC50
  Tab Delimited (TSV)   2D SDfile   Computed 3D by Vconf -m prep SDfile
Find this compound or compounds like it in BindingDB:
Activity Spreadsheet -- Enzyme Inhibition Constant Data from BindingDB
Found 1 hit for monomerid = 50009796
TargetAldo-keto reductase family 1 member B1(Homo sapiens (Human))
Pfizer
Curated by ChEMBL
LigandPNGBDBM50009796((3-Benzothiazol-2-ylmethyl-6-chloro-4-oxo-3,4-dihy...)
Affinity DataIC50:  15nM. Assay description: Inhibition of aldose reductase (aldo-keto reductase, AKR1B1) isolated from human placenta.
In DepthDetails ArticlePubMed