BDBM500098 US11021457, Compound 110
SMILES COCCOCCOc1ccccc1C1CC(=O)C(=CNc2cccc3C(=O)N(Cc23)C2CCC(=O)NC2=O)C(=O)C1
InChI Key InChIKey=ZDRMNZSYUWWUCV-XLNRJJMWSA-N
Data  1 IC50
  Tab Delimited (TSV)   2D SDfile   Computed 3D by Vconf -m prep SDfile
Find this compound or compounds like it in BindingDB:
Activity Spreadsheet -- Enzyme Inhibition Constant Data from BindingDB
Found 1 hit for monomerid = 500098
TargetMicrotubule-associated proteins 1A/1B light chain 3B(Human)
Wigen Biomedicine Technology (Shanghai)
US Patent
LigandPNGBDBM500098(US11021457, Compound 110)
Affinity DataIC50:  275nM. Assay description: By constructing a prokaryotic expression system, the LC3B protein was successfully expressed and purified, and a preliminary screening and verificati...
Ligand InfoPC cidPC sid
In DepthDetails US Patent