BDBM50009807 CHEMBL279673::[3-(6-Bromo-benzothiazol-2-ylmethyl)-6,7-dichloro-4-oxo-3,4-dihydro-phthalazin-1-yl]-acetic acid
SMILES OC(=O)Cc1nn(Cc2nc3ccc(Br)cc3s2)c(=O)c2cc(Cl)c(Cl)cc12
InChI Key InChIKey=PMHBARXTNRTBSR-UHFFFAOYSA-N
Data  1 IC50
  Tab Delimited (TSV)   2D SDfile   Computed 3D by Vconf -m prep SDfile
Find this compound or compounds like it in BindingDB:
Activity Spreadsheet -- Enzyme Inhibition Constant Data from BindingDB
Found 1 hit for monomerid = 50009807
TargetAldo-keto reductase family 1 member B1(Homo sapiens (Human))
Pfizer
Curated by ChEMBL
LigandPNGBDBM50009807(CHEMBL279673 | [3-(6-Bromo-benzothiazol-2-ylmethyl...)
Affinity DataIC50:  1.80E+3nM. Assay description: Inhibition of aldose reductase (aldo-keto reductase, AKR1B1) isolated from human placenta.
In DepthDetails ArticlePubMed