BDBM50009823 (3-Benzothiazol-2-ylmethyl-7-methoxy-4-oxo-3,4-dihydro-phthalazin-1-yl)-acetic acid::CHEMBL19759
SMILES COc1ccc2c(c1)c(CC(O)=O)nn(Cc1nc3ccccc3s1)c2=O
InChI Key InChIKey=GAABTUJRXYWNFC-UHFFFAOYSA-N
Data  1 IC50
  Tab Delimited (TSV)   2D SDfile   Computed 3D by Vconf -m prep SDfile
Find this compound or compounds like it in BindingDB:
Activity Spreadsheet -- Enzyme Inhibition Constant Data from BindingDB
Found 1 hit for monomerid = 50009823
TargetAldo-keto reductase family 1 member B1(Homo sapiens (Human))
Pfizer
Curated by ChEMBL
LigandPNGBDBM50009823((3-Benzothiazol-2-ylmethyl-7-methoxy-4-oxo-3,4-dih...)
Affinity DataIC50:  28nM. Assay description: Inhibition of aldose reductase (aldo-keto reductase, AKR1B1) isolated from human placenta.
In DepthDetails ArticlePubMed