BDBM50009845 1-(3,4-Dichloro-benzyl)-4-hydroxy-5-oxo-2,5-dihydro-1H-pyrrole-3-carboxylic acid ethyl ester::CHEMBL7415
SMILES CCOC(=O)C1CN(Cc2ccc(Cl)c(Cl)c2)C(=O)C1=O
InChI Key InChIKey=XXUGJIVIFONKQL-UHFFFAOYSA-N
Data  1 IC50
  Tab Delimited (TSV)   2D SDfile   Computed 3D by Vconf -m prep SDfile
Find this compound or compounds like it in BindingDB:
Activity Spreadsheet -- Enzyme Inhibition Constant Data from BindingDB
Found 1 hit for monomerid = 50009845
TargetAldo-keto reductase family 1 member B1(Homo sapiens (Human))
Pfizer
Curated by ChEMBL
LigandPNGBDBM50009845(1-(3,4-Dichloro-benzyl)-4-hydroxy-5-oxo-2,5-dihydr...)
Affinity DataIC50:  240nM. Assay description: In vitro inhibition of human placental aldose reductase.Checked by Author
In DepthDetails ArticlePubMed