BDBM50009857 (4-Methoxy-phenyl)-[2-methyl-1-(1-methyl-2-morpholin-4-yl-ethyl)-1H-indol-3-yl]-methanone::CHEMBL275241
SMILES COc1ccc(cc1)C(=O)c1c(C)n(C(C)CN2CCOCC2)c2ccccc12
InChI Key InChIKey=YKMQWFRCMFOWQD-UHFFFAOYSA-N
Data  1 IC50
  Tab Delimited (TSV)   2D SDfile   Computed 3D by Vconf -m prep SDfile
Find this compound or compounds like it in BindingDB:
Activity Spreadsheet -- Enzyme Inhibition Constant Data from BindingDB
Found 1 hit for monomerid = 50009857
TargetProstaglandin-H2 D-isomerase(Mus musculus)
Sterling Research Group
Curated by ChEMBL
LigandPNGBDBM50009857((4-Methoxy-phenyl)-[2-methyl-1-(1-methyl-2-morphol...)
Affinity DataIC50:  900nM. Assay description: Concentration required to inhibit 50% activity of prostaglandin synthetase was determined in vitro in mouse brain microsomes
In DepthDetails ArticlePubMed