BDBM50009865 (4-Methoxy-phenyl)-[2-methyl-1-(6-morpholin-4-yl-hexyl)-1H-indol-3-yl]-methanone::CHEMBL273700
SMILES COc1ccc(cc1)C(=O)c1c(C)n(CCCCCCN2CCOCC2)c2ccccc12
InChI Key InChIKey=MVRWCVWBFVDYST-UHFFFAOYSA-N
Data  1 IC50
  Tab Delimited (TSV)   2D SDfile   Computed 3D by Vconf -m prep SDfile
Find this compound or compounds like it in BindingDB:
Activity Spreadsheet -- Enzyme Inhibition Constant Data from BindingDB
Found 1 hit for monomerid = 50009865
TargetProstaglandin-H2 D-isomerase(Mus musculus)
Sterling Research Group
Curated by ChEMBL
LigandPNGBDBM50009865((4-Methoxy-phenyl)-[2-methyl-1-(6-morpholin-4-yl-h...)
Affinity DataIC50:  500nM. Assay description: Concentration required to inhibit 50% activity of prostaglandin synthetase was determined in vitro in mouse brain microsomes
In DepthDetails ArticlePubMed