BDBM50009888 CHEMBL277437::[5-{1-[1-Hydroxy-2-(2-methyl-butylcarbamoyl)-ethyl]-3-methyl-butylcarbamoyl}-5-(3-naphthalen-1-yl-2-naphthalen-1-ylmethyl-propionylamino)-pentyl]-phosphoramidic acid diphenyl ester
SMILES CCC(C)CNC(=O)C[C@H](O)C(CC(C)C)NC(=O)C(CCCCNP(=O)(Oc1ccccc1)Oc1ccccc1)NC(=O)C(Cc1cccc2ccccc12)Cc1cccc2ccccc12
InChI Key InChIKey=JYTPTLAXGLKOFL-YPWRFBJASA-N
Data  1 IC50
  Tab Delimited (TSV)   2D SDfile   Computed 3D by Vconf -m prep SDfile
Find this compound or compounds like it in BindingDB:
Activity Spreadsheet -- Enzyme Inhibition Constant Data from BindingDB
Found 1 hit for monomerid = 50009888
TargetRenin(Homo sapiens (Human))
Warner-Lambert
Curated by ChEMBL
LigandPNGBDBM50009888(CHEMBL277437 | [5-{1-[1-Hydroxy-2-(2-methyl-butylc...)
Affinity DataIC50:  740nM. Assay description: Inhibitory activity against human plasma renin
In DepthDetails ArticlePubMed