BDBM50009964 CHEMBL3251194
SMILES NC(=N)c1ccc(cc1)-c1cc2cc(cc(C(N)=N)c2o1)C(N)=N
InChI Key InChIKey=QWDKGFMQMOZBMI-UHFFFAOYSA-N
Data  2 KI
  Tab Delimited (TSV)   2D SDfile   Computed 3D by Vconf -m prep SDfile
Find this compound or compounds like it in BindingDB:
Activity Spreadsheet -- Enzyme Inhibition Constant Data from BindingDB
Found 2 hits for monomerid = 50009964
TargetGlandular kallikrein(Sus scrofa)
TBA
Curated by ChEMBL
LigandPNGBDBM50009964(CHEMBL3251194)
Affinity DataKi:  1.23E+4nM. Assay description: Competitive reversible inhibition of porcine pancreatic kallikrein using alpha-N-benzoyl-DL-arginine-p-nitroanilide hydrochloride as substrate after ...
In DepthDetails ArticlePubMed
TargetProthrombin(Bos taurus (Bovine))
TBA
Curated by ChEMBL
LigandPNGBDBM50009964(CHEMBL3251194)
Affinity DataKi:  5.38E+4nM. Assay description: Competitive reversible inhibition of bovine thrombin using alpha-N-benzoyl-DL-arginine-p-nitroanilide hydrochloride as substrate after 15 to 40 mins ...
In DepthDetails ArticlePubMed