BDBM50009966 CHEMBL164947
SMILES NC(=N)c1ccc(NC(=O)c2cc3cc(ccc3s2)C(N)=N)cc1
InChI Key InChIKey=PTVUEPBSVZQNED-UHFFFAOYSA-N
Data  2 KI
  Tab Delimited (TSV)   2D SDfile   Computed 3D by Vconf -m prep SDfile
Find this compound or compounds like it in BindingDB:
Activity Spreadsheet -- Enzyme Inhibition Constant Data from BindingDB
Found 2 hits for monomerid = 50009966
TargetGlandular kallikrein(Sus scrofa)
TBA
Curated by ChEMBL
LigandPNGBDBM50009966(CHEMBL164947)
Affinity DataKi:  7.76E+3nM. Assay description: Competitive reversible inhibition of porcine pancreatic kallikrein using alpha-N-benzoyl-DL-arginine-p-nitroanilide hydrochloride as substrate after ...
In DepthDetails ArticlePubMed
TargetProthrombin(Bos taurus (Bovine))
TBA
Curated by ChEMBL
LigandPNGBDBM50009966(CHEMBL164947)
Affinity DataKi:  1.42E+4nM. Assay description: Competitive reversible inhibition of bovine thrombin using alpha-N-benzoyl-DL-arginine-p-nitroanilide hydrochloride as substrate after 15 to 40 mins ...
In DepthDetails ArticlePubMed