BDBM50009981 CHEMBL305492::[(Naphthalene-2-carbonyl)-phenyl-amino]-acetic acid
SMILES OC(=O)CN(C(=O)c1ccc2ccccc2c1)c1ccccc1
InChI Key InChIKey=PJLBSTQOBBWHCI-UHFFFAOYSA-N
Data  1 IC50
  Tab Delimited (TSV)   2D SDfile   Computed 3D by Vconf -m prep SDfile
Find this compound or compounds like it in BindingDB:
Activity Spreadsheet -- Enzyme Inhibition Constant Data from BindingDB
Found 1 hit for monomerid = 50009981
TargetAldo-keto reductase family 1 member B1(Rattus norvegicus)
Auburn University
Curated by ChEMBL
LigandPNGBDBM50009981(CHEMBL305492 | [(Naphthalene-2-carbonyl)-phenyl-am...)
Affinity DataIC50:  1.90E+4nM. Assay description: Inhibitory activity against aldose reductase in rat lens
In DepthDetails ArticlePubMed