BDBM50009991 CHEMBL67731::[Methyl-(naphthalene-2-carbonyl)-amino]-acetic acid
SMILES CN(CC(O)=O)C(=O)c1ccc2ccccc2c1
InChI Key InChIKey=FZXHUEVCBVDVGG-UHFFFAOYSA-N
Data  1 IC50
  Tab Delimited (TSV)   2D SDfile   Computed 3D by Vconf -m prep SDfile
Find this compound or compounds like it in BindingDB:
Activity Spreadsheet -- Enzyme Inhibition Constant Data from BindingDB
Found 1 hit for monomerid = 50009991
TargetAldo-keto reductase family 1 member B1(Rattus norvegicus)
Auburn University
Curated by ChEMBL
LigandPNGBDBM50009991(CHEMBL67731 | [Methyl-(naphthalene-2-carbonyl)-ami...)
Affinity DataIC50:  1.90E+4nM. Assay description: Inhibitory activity against aldose reductase in rat lens
In DepthDetails ArticlePubMed