BDBM50010001 CHEMBL68391::[Methyl-(4-nitro-benzoyl)-amino]-acetic acid
SMILES CN(CC(O)=O)C(=O)c1ccc(cc1)[N+]([O-])=O
InChI Key InChIKey=UMZUJULAJNWKSG-UHFFFAOYSA-N
Data  1 IC50
  Tab Delimited (TSV)   2D SDfile   Computed 3D by Vconf -m prep SDfile
Find this compound or compounds like it in BindingDB:
Activity Spreadsheet -- Enzyme Inhibition Constant Data from BindingDB
Found 1 hit for monomerid = 50010001
TargetAldo-keto reductase family 1 member B1(Rattus norvegicus)
Auburn University
Curated by ChEMBL
LigandPNGBDBM50010001(CHEMBL68391 | [Methyl-(4-nitro-benzoyl)-amino]-ace...)
Affinity DataIC50:  2.60E+4nM. Assay description: Inhibitory activity against aldose reductase in rat lens
In DepthDetails ArticlePubMed