BDBM50010092 CHEMBL2418041
SMILES NC(=N)c1ccc(OCc2ccc(cc2)[N+]([O-])=O)c(I)c1
InChI Key InChIKey=LGHOAFALOUHBGJ-UHFFFAOYSA-N
Data  1 KI
  Tab Delimited (TSV)   2D SDfile   Computed 3D by Vconf -m prep SDfile
Find this compound or compounds like it in BindingDB:
Activity Spreadsheet -- Enzyme Inhibition Constant Data from BindingDB
Found 1 hit for monomerid = 50010092
TargetAcrosin(Sus scrofa)
TBA
Curated by ChEMBL
LigandPNGBDBM50010092(CHEMBL2418041)
Affinity DataKi:  300nM. Assay description: Reversible competitive inhibition of boar spermatozoa acrosin using BzArgOEt as substrate by Dixon plot analysis
In DepthDetails ArticlePubMed