BDBM50010116 CHEMBL3245404
SMILES NC(=N)c1ccc(OCCCCCOc2ccc(cc2I)C(N)=N)c(I)c1
InChI Key InChIKey=XSKGQJKVEKGRNA-UHFFFAOYSA-N
Data  1 KI
  Tab Delimited (TSV)   2D SDfile   Computed 3D by Vconf -m prep SDfile
Find this compound or compounds like it in BindingDB:
Activity Spreadsheet -- Enzyme Inhibition Constant Data from BindingDB
Found 1 hit for monomerid = 50010116
TargetAcrosin(Sus scrofa)
TBA
Curated by ChEMBL
LigandPNGBDBM50010116(CHEMBL3245404)
Affinity DataKi:  1.00E+3nM. Assay description: Reversible competitive inhibition of boar spermatozoa acrosin using BzArgOEt as substrate by Dixon plot analysis
In DepthDetails ArticlePubMed