BDBM50010131 CHEMBL3245419
SMILES NC(=N)c1ccc(OCc2cc(COc3ccc(cc3)C(N)=N)cc(COc3ccc(cc3)[N+]([O-])=O)c2)cc1
InChI Key InChIKey=IYUUOLZUJFLIIE-UHFFFAOYSA-N
Data  1 KI
  Tab Delimited (TSV)   2D SDfile   Computed 3D by Vconf -m prep SDfile
Find this compound or compounds like it in BindingDB:
Activity Spreadsheet -- Enzyme Inhibition Constant Data from BindingDB
Found 1 hit for monomerid = 50010131
TargetAcrosin(Sus scrofa)
TBA
Curated by ChEMBL
LigandPNGBDBM50010131(CHEMBL3245419)
Affinity DataKi:  1.60E+3nM. Assay description: Reversible competitive inhibition of boar spermatozoa acrosin using BzArgOEt as substrate by Dixon plot analysis
In DepthDetails ArticlePubMed