BDBM50010155 CHEMBL320951::{2-Butyl-5-chloro-3-[6-(1H-tetrazol-5-yl)-naphthalen-1-ylmethyl]-3H-imidazol-4-yl}-methanol
SMILES CCCCc1nc(Cl)c(CO)n1Cc1cccc2cc(ccc12)-c1nnn[nH]1
InChI Key InChIKey=FNMGOGGSFXNBTK-UHFFFAOYSA-N
Data  1 IC50
  Tab Delimited (TSV)   2D SDfile   Computed 3D by Vconf -m prep SDfile
Find this compound or compounds like it in BindingDB:
Activity Spreadsheet -- Enzyme Inhibition Constant Data from BindingDB
Found 1 hit for monomerid = 50010155
TargetType-1 angiotensin II receptor B(RAT)
Ciba-Geigy
Curated by ChEMBL
LigandPNGBDBM50010155(CHEMBL320951 | {2-Butyl-5-chloro-3-[6-(1H-tetrazol...)
Affinity DataIC50:  4.10E+3nM. Assay description: Binding affinity against angiotensin II receptor in rat smooth muscle cell preparations
In DepthDetails ArticlePubMed