BDBM50010191 4-[5-amino-1-methylcarboxamido-(1S)-pentylcarboxamidomethylcarboxamido]-4-[1-carbamoyl-2-hydroxy-(1S)-ethylcarbamoyl]butanoic acid::CHEMBL107803
SMILES CC(=O)N[C@@H](CCCCN)C(=O)NCC(=O)N[C@@H](CCC(O)=O)C(=O)N[C@@H](CO)C(N)=O
InChI Key InChIKey=CLQLMIIUQYUWBV-AVGNSLFASA-N
Data  1 IC50
  Tab Delimited (TSV)   2D SDfile   Computed 3D by Vconf -m prep SDfile
Find this compound or compounds like it in BindingDB:
Activity Spreadsheet -- Enzyme Inhibition Constant Data from BindingDB
Found 1 hit for monomerid = 50010191
TargetIntegrin alpha-IIb/beta-3(Homo sapiens (Human))
Smithkline Beecham Pharmaceuticals Research And Development
Curated by ChEMBL
LigandPNGBDBM50010191(4-[5-amino-1-methylcarboxamido-(1S)-pentylcarboxam...)
Affinity DataIC50: >2.00E+5nM. Assay description: Inhibition of human washed platelet aggregation
In DepthDetails ArticlePubMed