BDBM50010422 CHEMBL545512::H-Phe-beta-Ala-ACHPA-Ile N-[(4-amino-2-methyl-5-pyrimidinyl)methyl]amide; dihydrochloride
SMILES CC[C@H](C)[C@H](NC(=O)C[C@H](O)[C@H](CC1CCCCC1)NC(=O)CCNC(=O)[C@@H](N)Cc1ccccc1)C(=O)NCc1cnc(C)nc1N
InChI Key InChIKey=OJUXFOTVKMYAOQ-MMTDUKOKSA-N
Data  3 IC50
  Tab Delimited (TSV)   2D SDfile   Computed 3D by Vconf -m prep SDfile
Find this compound or compounds like it in BindingDB:
Activity Spreadsheet -- Enzyme Inhibition Constant Data from BindingDB
Found 3 hits for monomerid = 50010422
TargetRenin(Homo sapiens (Human))
E. Merck Darmstadt
Curated by ChEMBL
LigandPNGBDBM50010422(CHEMBL545512 | H-Phe-beta-Ala-ACHPA-Ile N-[(4-amin...)
Affinity DataIC50:  20nM. Assay description: In vitro for inhibitory activity against human renin
In DepthDetails ArticlePubMed
TargetPepsin A(Porcine)
E. Merck Darmstadt
Curated by ChEMBL
LigandPNGBDBM50010422(CHEMBL545512 | H-Phe-beta-Ala-ACHPA-Ile N-[(4-amin...)
Affinity DataIC50: >1.00E+4nM. Assay description: In vitro inhibitory activity against porcine Pepsin.
In DepthDetails ArticlePubMed
TargetCathepsin D(Bos taurus)
E. Merck Darmstadt
Curated by ChEMBL
LigandPNGBDBM50010422(CHEMBL545512 | H-Phe-beta-Ala-ACHPA-Ile N-[(4-amin...)
Affinity DataIC50: >1.00E+4nM. Assay description: In vitro inhibitory activity against bovine Cathepsin D
In DepthDetails ArticlePubMed