BDBM50010557 6-[3-(4-Acetylamino-phenoxy)-2-hydroxy-propylamino]-heptanoic acid (4-trifluoromethyl-phenyl)-amide(R,S)::CHEMBL69036
SMILES C[C@@H](CCCCC(=O)Nc1ccc(cc1)C(F)(F)F)NC[C@@H](O)COc1ccc(NC(C)=O)cc1
InChI Key InChIKey=WNEIZOXOSDHMKM-HTAPYJJXSA-N
Data  1 KI
  Tab Delimited (TSV)   2D SDfile   Computed 3D by Vconf -m prep SDfile
Find this compound or compounds like it in BindingDB:
Activity Spreadsheet -- Enzyme Inhibition Constant Data from BindingDB
Found 1 hit for monomerid = 50010557
TargetBeta-2 adrenergic receptor(Mus musculus)
University Of California
Curated by ChEMBL
LigandPNGBDBM50010557(6-[3-(4-Acetylamino-phenoxy)-2-hydroxy-propylamino...)
Affinity DataKi:  6.20E+4nM. Assay description: Ki value was determined by accumulation of c-AMP in S-49 mouse lymphoma cells (Beta2).
In DepthDetails ArticlePubMed