BDBM50010561 6-[2-Hydroxy-3-(naphthalen-1-yloxy)-propylamino]-heptanoic acid (4-trifluoromethyl-phenyl)-amide(S,R)::CHEMBL70539
SMILES C[C@H](CCCCC(=O)Nc1ccc(cc1)C(F)(F)F)NC[C@H](O)COc1cccc2ccccc12
InChI Key InChIKey=MZPZPLOHGVBKAT-XXBNENTESA-N
Data  1 KI
  Tab Delimited (TSV)   2D SDfile   Computed 3D by Vconf -m prep SDfile
Find this compound or compounds like it in BindingDB:
Activity Spreadsheet -- Enzyme Inhibition Constant Data from BindingDB
Found 1 hit for monomerid = 50010561
TargetBeta-2 adrenergic receptor(Mus musculus)
University Of California
Curated by ChEMBL
LigandPNGBDBM50010561(6-[2-Hydroxy-3-(naphthalen-1-yloxy)-propylamino]-h...)
Affinity DataKi:  4.59E+4nM. Assay description: Ki value was determined by accumulation of c-AMP in S-49 mouse lymphoma cells (Beta2).
In DepthDetails ArticlePubMed