BDBM50010587 3-Dipropylamino-chroman-6-ol::CHEMBL69414
SMILES CCCN(CCC)C1COc2ccc(O)cc2C1
InChI Key InChIKey=COYBCQFIVNQGKW-UHFFFAOYSA-N
Data  5 IC50
  Tab Delimited (TSV)   2D SDfile   Computed 3D by Vconf -m prep SDfile
Find this compound or compounds like it in BindingDB:
Activity Spreadsheet -- Enzyme Inhibition Constant Data from BindingDB
Found 5 hits for monomerid = 50010587
TargetD(2) dopamine receptor(Rattus norvegicus (rat))
Warner-Lambert
Curated by ChEMBL
LigandPNGBDBM50010587(3-Dipropylamino-chroman-6-ol | CHEMBL69414)
Affinity DataIC50:  800nM. Assay description: Concentration of the compound inhibiting specific binding of [3H]-haloperidol to Dopamine receptor D2 from rat striatal brain.
In DepthDetails ArticlePubMed
TargetD(2) dopamine receptor(Rattus norvegicus (rat))
Warner-Lambert
Curated by ChEMBL
LigandPNGBDBM50010587(3-Dipropylamino-chroman-6-ol | CHEMBL69414)
Affinity DataIC50:  13nM. Assay description: Affinity of the compound for [3H]-N-propylnorapomorphine (NPA) Dopamine receptor D2
In DepthDetails ArticlePubMed
TargetD(1A)/D(1B)/D(2)/D(3)/D(4) dopamine receptor(Rattus norvegicus (rat))
Warner-Lambert
Curated by ChEMBL
LigandPNGBDBM50010587(3-Dipropylamino-chroman-6-ol | CHEMBL69414)
Affinity DataIC50:  13nM. Assay description: In vitro affinity to dopamine receptor using [3H]NPAD as radioligand in rat striatal membranes
In DepthDetails ArticlePubMed
TargetD(1A)/D(1B)/D(2)/D(3)/D(4) dopamine receptor(Rattus norvegicus (rat))
Warner-Lambert
Curated by ChEMBL
LigandPNGBDBM50010587(3-Dipropylamino-chroman-6-ol | CHEMBL69414)
Affinity DataIC50:  800nM. Assay description: In vitro affinity to dopamine receptor using [3H]HPD as radioligand in rat striatal membranes
In DepthDetails ArticlePubMed
TargetD(2) dopamine receptor(Rattus norvegicus (rat))
Warner-Lambert
Curated by ChEMBL
LigandPNGBDBM50010587(3-Dipropylamino-chroman-6-ol | CHEMBL69414)
Affinity DataIC50:  180nM. Assay description: Potency to displace the specific in vitro binding of [3H]DP-5,6-ADTN to rat striatal membrane
In DepthDetails ArticlePubMed