BDBM50010717 8-Chloro-3-methyl-5-o-tolyl-2,3,4,5-tetrahydro-1H-benzo[d]azepin-7-ol::CHEMBL444321
SMILES CN1CCc2cc(Cl)c(O)cc2[C@H](C1)c1ccccc1C
InChI Key InChIKey=IUSYOTYODLWHQQ-MRXNPFEDSA-N
Data  1 KI
  Tab Delimited (TSV)   2D SDfile   Computed 3D by Vconf -m prep SDfile
Find this compound or compounds like it in BindingDB:
Activity Spreadsheet -- Enzyme Inhibition Constant Data from BindingDB
Found 1 hit for monomerid = 50010717
TargetD(1A) dopamine receptor(Homo sapiens (Human))
Royal Danish School Of Pharmacy
Curated by ChEMBL
LigandPNGBDBM50010717(8-Chloro-3-methyl-5-o-tolyl-2,3,4,5-tetrahydro-1H-...)
Affinity DataKi:  0.800nM. Assay description: Binding affinity to displace [3H]- SCH 23390 against Dopamine receptor D1
In DepthDetails ArticlePubMed