BDBM50010720 5-Bromo-2,3-dihydro-benzofuran-7-carboxylic acid (1-ethyl-pyrrolidin-2-ylmethyl)-amide::CHEMBL301532
SMILES CCN1CCC[C@H]1CNC(=O)c1cc(Br)cc2CCOc12
InChI Key InChIKey=VRMUQJZSWAAYCB-ZDUSSCGKSA-N
Data  1 KI  1 IC50
  Tab Delimited (TSV)   2D SDfile   Computed 3D by Vconf -m prep SDfile
Find this compound or compounds like it in BindingDB:
Activity Spreadsheet -- Enzyme Inhibition Constant Data from BindingDB
Found 2 hits for monomerid = 50010720
TargetD(2) dopamine receptor(Rattus norvegicus (rat))
University Of Pennsylvania
Curated by ChEMBL
LigandPNGBDBM50010720(5-Bromo-2,3-dihydro-benzofuran-7-carboxylic acid (...)
Affinity DataKi:  3.90nM. Assay description: Competitive binding assay against Dopamine receptor D2 in rat striatal membranes and [125I]-IBF radioligand
In DepthDetails ArticlePubMed
TargetD(2) dopamine receptor(Rattus norvegicus (rat))
University Of Pennsylvania
Curated by ChEMBL
LigandPNGBDBM50010720(5-Bromo-2,3-dihydro-benzofuran-7-carboxylic acid (...)
Affinity DataIC50:  7.20nM. Assay description: The affinity for the Dopamine receptor D2 was assessed by the inhibition of [3H]-spiperone binding in rat striatal membranes in vitro.
In DepthDetails ArticlePubMed