BDBM50010737 CHEMBL79616::N,N-Diphenyl-guanidine
SMILES NC(=N)N(c1ccccc1)c1ccccc1
InChI Key InChIKey=MFHNAXHSHOCFEC-UHFFFAOYSA-N
Data  1 IC50
  Tab Delimited (TSV)   2D SDfile   Computed 3D by Vconf -m prep SDfile
Find this compound or compounds like it in BindingDB:
Activity Spreadsheet -- Enzyme Inhibition Constant Data from BindingDB
Found 1 hit for monomerid = 50010737
TargetSigma non-opioid intracellular receptor 1(Homo sapiens (Human))
University Of Oregon
Curated by ChEMBL
LigandPNGBDBM50010737(CHEMBL79616 | N,N-Diphenyl-guanidine)
Affinity DataIC50: >1.00E+5nM. Assay description: In vitro inhibitory activity against [3H]-DTG in guinea pig brain membrane homogenates
In DepthDetails ArticlePubMed