BDBM50010760 CHEMBL310170::N,N'-Bis-(2-ethyl-phenyl)-guanidine
SMILES CCc1ccccc1NC(N)=Nc1ccccc1CC
InChI Key InChIKey=AJNXCTFYCKDBPU-UHFFFAOYSA-N
Data  3 IC50
  Tab Delimited (TSV)   2D SDfile   Computed 3D by Vconf -m prep SDfile
Find this compound or compounds like it in BindingDB:
Activity Spreadsheet -- Enzyme Inhibition Constant Data from BindingDB
Found 3 hits for monomerid = 50010760
TargetSigma non-opioid intracellular receptor 1(Homo sapiens (Human))
University Of Oregon
Curated by ChEMBL
LigandPNGBDBM50010760(CHEMBL310170 | N,N'-Bis-(2-ethyl-phenyl)-guanidine)
Affinity DataIC50:  13.8nM. Assay description: In vitro inhibitory activity against [3H]DTG binding to Sigma opioid receptor in guinea pig brain membrane homogenates
In DepthDetails ArticlePubMed
TargetSigma non-opioid intracellular receptor 1(Homo sapiens (Human))
University Of Oregon
Curated by ChEMBL
LigandPNGBDBM50010760(CHEMBL310170 | N,N'-Bis-(2-ethyl-phenyl)-guanidine)
Affinity DataIC50:  14nM. Assay description: In vitro inhibitory activity against [3H]DTG binding to Sigma opioid receptor in guinea pig brain membrane homogenates
In DepthDetails ArticlePubMed
TargetSigma non-opioid intracellular receptor 1(Homo sapiens (Human))
University Of Oregon
Curated by ChEMBL
LigandPNGBDBM50010760(CHEMBL310170 | N,N'-Bis-(2-ethyl-phenyl)-guanidine)
Affinity DataIC50:  14nM. Assay description: Tested in vitro for the concentration required to inhibit specific [3H]-DTG radioligand binding to sigma receptor on guinea pig brain membrane
In DepthDetails ArticlePubMed