BDBM50010770 CHEMBL79165::N,N'-Bis-(4-amino-2-methyl-phenyl)-guanidine (3HCl)
SMILES Cc1cc(N)ccc1NC(N)=Nc1ccc(N)cc1C
InChI Key InChIKey=HEQWVPLGKMEJCN-UHFFFAOYSA-N
Data  2 IC50
  Tab Delimited (TSV)   2D SDfile   Computed 3D by Vconf -m prep SDfile
Find this compound or compounds like it in BindingDB:
Activity Spreadsheet -- Enzyme Inhibition Constant Data from BindingDB
Found 2 hits for monomerid = 50010770
TargetSigma non-opioid intracellular receptor 1(Homo sapiens (Human))
University Of Oregon
Curated by ChEMBL
LigandPNGBDBM50010770(CHEMBL79165 | N,N'-Bis-(4-amino-2-methyl-phenyl)-g...)
Affinity DataIC50:  5.10E+3nM. Assay description: In vitro inhibitory activity against [3H]DTG binding to Sigma opioid receptor in guinea pig brain membrane homogenates
In DepthDetails ArticlePubMed
TargetSigma non-opioid intracellular receptor 1(Homo sapiens (Human))
University Of Oregon
Curated by ChEMBL
LigandPNGBDBM50010770(CHEMBL79165 | N,N'-Bis-(4-amino-2-methyl-phenyl)-g...)
Affinity DataIC50:  7.15E+3nM. Assay description: In vitro inhibitory activity against [3H]DTG binding to Sigma opioid receptor in guinea pig brain membrane homogenates
In DepthDetails ArticlePubMed