BDBM50010780 CHEMBL543602::N-Adamantan-2-yl-N'-(2-styryl-phenyl)-guanidine; hydrochloride
SMILES NC(Nc1ccccc1C=Cc1ccccc1)=NC1C2CC3CC(C2)CC1C3
InChI Key InChIKey=NPDRLZZMBVMRBB-UHFFFAOYSA-N
Data  1 IC50
  Tab Delimited (TSV)   2D SDfile   Computed 3D by Vconf -m prep SDfile
Find this compound or compounds like it in BindingDB:
Activity Spreadsheet -- Enzyme Inhibition Constant Data from BindingDB
Found 1 hit for monomerid = 50010780
TargetSigma non-opioid intracellular receptor 1(Homo sapiens (Human))
University Of Oregon
Curated by ChEMBL
LigandPNGBDBM50010780(CHEMBL543602 | N-Adamantan-2-yl-N'-(2-styryl-pheny...)
Affinity DataIC50:  370nM. Assay description: In vitro inhibitory activity against [3H]DTG binding to Sigma opioid receptor in guinea pig brain membrane homogenates
In DepthDetails ArticlePubMed