BDBM50010785 CHEMBL543839::N,N'-Di-adamantan-2-yl-guanidine; hydrochloride
SMILES NC(NC1C2CC3CC(C2)CC1C3)=NC1C2CC3CC(C2)CC1C3
InChI Key InChIKey=REMWNWPUZRLBMA-UHFFFAOYSA-N
Data  1 IC50
  Tab Delimited (TSV)   2D SDfile   Computed 3D by Vconf -m prep SDfile
Find this compound or compounds like it in BindingDB:
Activity Spreadsheet -- Enzyme Inhibition Constant Data from BindingDB
Found 1 hit for monomerid = 50010785
TargetSigma non-opioid intracellular receptor 1(Homo sapiens (Human))
University Of Oregon
Curated by ChEMBL
LigandPNGBDBM50010785(CHEMBL543839 | N,N'-Di-adamantan-2-yl-guanidine; h...)
Affinity DataIC50:  203nM. Assay description: In vitro inhibitory activity against [3H]DTG binding to Sigma opioid receptor in guinea pig brain membrane homogenates
In DepthDetails ArticlePubMed