BDBM50010810 CHEMBL79509::N,N'-Di-naphthalen-1-yl-guanidine
SMILES NC(Nc1cccc2ccccc12)=Nc1cccc2ccccc12
InChI Key InChIKey=ZRFIENOINCBMSZ-UHFFFAOYSA-N
Data  2 IC50
  Tab Delimited (TSV)   2D SDfile   Computed 3D by Vconf -m prep SDfile
Find this compound or compounds like it in BindingDB:
Activity Spreadsheet -- Enzyme Inhibition Constant Data from BindingDB
Found 2 hits for monomerid = 50010810
TargetSigma non-opioid intracellular receptor 1(Homo sapiens (Human))
University Of Oregon
Curated by ChEMBL
LigandPNGBDBM50010810(CHEMBL79509 | N,N'-Di-naphthalen-1-yl-guanidine)
Affinity DataIC50:  133nM. Assay description: In vitro inhibitory activity against [3H]DTG binding to Sigma opioid receptor in guinea pig brain membrane homogenates
In DepthDetails ArticlePubMed
TargetSigma non-opioid intracellular receptor 1(Homo sapiens (Human))
University Of Oregon
Curated by ChEMBL
LigandPNGBDBM50010810(CHEMBL79509 | N,N'-Di-naphthalen-1-yl-guanidine)
Affinity DataIC50:  165nM. Assay description: Tested in vitro for the concentration required to inhibit specific [3H]-DTG radioligand binding to sigma receptor on guinea pig brain membrane
In DepthDetails ArticlePubMed