BDBM50010837 1-{2-[4-(3H-Imidazol-1-yl)-phenoxy]-ethylamino}-3-[4-(2-methoxy-ethyl)-phenoxy]-propan-2-ol::CHEMBL95457
SMILES COCCc1ccc(OCC(O)CNCCOc2ccc(cc2)-n2ccnc2)cc1
InChI Key InChIKey=LHDUUWAMFCDNEW-UHFFFAOYSA-N
Data  3 IC50
  Tab Delimited (TSV)   2D SDfile   Computed 3D by Vconf -m prep SDfile
Find this compound or compounds like it in BindingDB:
Activity Spreadsheet -- Enzyme Inhibition Constant Data from BindingDB
Found 3 hits for monomerid = 50010837
TargetBeta-2 adrenergic receptor(Canis familiaris)
Berlex Laboratories
Curated by ChEMBL
LigandPNGBDBM50010837(1-{2-[4-(3H-Imidazol-1-yl)-phenoxy]-ethylamino}-3-...)
Affinity DataIC50:  4.50E+3nM. Assay description: Beta2-receptor selectivity in canine lung tissue in anesthetized dogs
In DepthDetails ArticlePubMed
TargetBeta-1/Beta-2/Beta-3 adrenergic receptor(Homo sapiens (Human))
Berlex Laboratories
Curated by ChEMBL
LigandPNGBDBM50010837(1-{2-[4-(3H-Imidazol-1-yl)-phenoxy]-ethylamino}-3-...)
Affinity DataIC50:  270nM. Assay description: Tested for beta-receptor binding inhibition from canine ventricular tissue, using [3H]dihydroalprenolol as the radioligand in anesthetized dogs
In DepthDetails ArticlePubMed
TargetBeta-1 adrenergic receptor(Homo sapiens (Human))
Berlex Laboratories
Curated by ChEMBL
LigandPNGBDBM50010837(1-{2-[4-(3H-Imidazol-1-yl)-phenoxy]-ethylamino}-3-...)
Affinity DataIC50:  270nM. Assay description: Tested for beta1-receptor selectivity in canine cardiac tissue in anesthetized dogs
In DepthDetails ArticlePubMed