BDBM50010883 1-[1-(4-Amino-phenyl)-2-dimethylamino-ethyl]-cyclohexanol(2C2H2O4)::CHEMBL318234
SMILES CN(C)CC(c1ccc(N)cc1)C1(O)CCCCC1
InChI Key InChIKey=JCGKDKLOBKOKQH-UHFFFAOYSA-N
Data  1 IC50
  Tab Delimited (TSV)   2D SDfile   Computed 3D by Vconf -m prep SDfile
Find this compound or compounds like it in BindingDB:
Activity Spreadsheet -- Enzyme Inhibition Constant Data from BindingDB
Found 1 hit for monomerid = 50010883
TargetAlpha-1A adrenergic receptor(Rattus norvegicus (Rat))
Wyeth-Ayerst Research
Curated by ChEMBL
LigandPNGBDBM50010883(1-[1-(4-Amino-phenyl)-2-dimethylamino-ethyl]-cyclo...)
Affinity DataIC50: >1.00E+4nM. Assay description: Inhibition of binding of [3H]imipramine to imipramine receptor in rat brain
In DepthDetails ArticlePubMed