BDBM50010887 1-[1-(2-Bromo-phenyl)-2-dimethylamino-ethyl]-cyclohexanol(HCl)::CHEMBL321364
SMILES CN(C)CC(c1ccccc1Br)C1(O)CCCCC1
InChI Key InChIKey=RXLTXBKNARFTEK-UHFFFAOYSA-N
Data  1 IC50
  Tab Delimited (TSV)   2D SDfile   Computed 3D by Vconf -m prep SDfile
Find this compound or compounds like it in BindingDB:
Activity Spreadsheet -- Enzyme Inhibition Constant Data from BindingDB
Found 1 hit for monomerid = 50010887
TargetAlpha-1A adrenergic receptor(Rattus norvegicus (Rat))
Wyeth-Ayerst Research
Curated by ChEMBL
LigandPNGBDBM50010887(1-[1-(2-Bromo-phenyl)-2-dimethylamino-ethyl]-cyclo...)
Affinity DataIC50:  260nM. Assay description: Inhibition of binding of [3H]imipramine to imipramine receptor in rat brain
In DepthDetails ArticlePubMed